Reaction Details
TargetNitric oxide synthase, brain
LigandBDBM50058446
Substrate/Competitorn/a
Meas. Tech.ChEMBL_143376 (CHEMBL880847)
Ki 1000±n/a nM
Citation Shearer, BGLee, SOplinger, JAFrick, LWGarvey, EPFurfine, ES Substituted N-phenylisothioureas: potent inhibitors of human nitric oxide synthase with neuronal isoform selectivity. J Med Chem40:1901-5 (1997) 
 
Nitric oxide synthase, brain
Name:Nitric oxide synthase, brain
Type:Homodimer
Mol. Mass.:160985.98
Organism:Homo sapiens (Human)
Description:P29475
Residue:1434
BDBM50058446
NameBDBM50058446
Synonyms:2-Ethyl-1-pyridin-3-yl-isothiourea; hydrochloride CHEMBL542125
TypeSmall organic molecule
Emp. Form.C8H11N3S
Mol. Mass.181.258
SMILESCCSC(N)=Nc1cccnc1