Reaction Details
TargetPolyunsaturated fatty acid 5-lipoxygenase
LigandBDBM50029778
Substrate/Competitorn/a
Meas. Tech.ChEMBL_90070 (CHEMBL701321)
IC50 60±n/a nM
Citation Stewart, AOBhatia, PAMartin, JGSummers, JBRodriques, KEMartin, MBHolms, JHMoore, JLCraig, RAKolasa, TRatajczyk, JDMazdiyasni, HKerdesky, FADeNinno, SLMaki, RGBouska, JBYoung, PRLanni, CBell, RLCarter, GWBrooks, CD Structure-activity relationships of N-hydroxyurea 5-lipoxygenase inhibitors. J Med Chem40:1955-68 (1997) 
 
Polyunsaturated fatty acid 5-lipoxygenase
Name:Polyunsaturated fatty acid 5-lipoxygenase
Type:Enzyme
Mol. Mass.:77972.74
Organism:Homo sapiens (Human)
Description:Recombinant protein was purified from E. coli lysate. After ammonium sulfate precipitation and subsequent steps, the supernatant (S100) was used for 5-LO activity assay.
Residue:674
BDBM50029778
NameBDBM50029778
Synonyms:CHEMBL264717 N-{3-[5-(4-fluorophenoxy)furan-2-yl]prop-2-ynyl}-N-hydroxyurea
TypeSmall organic molecule
Emp. Form.C14H11FN2O4
Mol. Mass.290.2465
SMILESNC(=O)N(O)CC#Cc1ccc(Oc2ccc(F)cc2)o1