Reaction Details
TargetMelanocortin receptor 4
LigandBDBM50034922
Substrate/Competitorn/a
Meas. Tech.ChEMBL_106326 (CHEMBL709897)
EC50 793±n/a nM
Citation Haskell-Luevano, CHendrata, SNorth, CSawyer, TKHadley, MEHruby, VJDickinson, CGantz, I Discovery of prototype peptidomimetic agonists at the human melanocortin receptors MC1R and MC4R. J Med Chem40:2133-9 (1997) 
 
Melanocortin receptor 4
Name:Melanocortin receptor 4
Type:Enzyme
Mol. Mass.:36949.50
Organism:Homo sapiens (Human)
Description:P32245
Residue:332
BDBM50034922
NameBDBM50034922
Synonyms:(S)-2-{(R)-2-[(S)-2-Acetylamino-3-(1H-imidazol-4-yl)-propionylamino]-3-phenyl-propionylamino}-5-guanidino-pentanoic acid [(S)-1-carbamoyl-2-(1H-indol-3-yl)-ethyl]-amide 1N-[1-carbamoyl-2-(1H-3-indolyl)-(1S)-ethyl]-5-amino(imino)methylamino-2-[1-[2-(1H-5-imidazolyl)-1-methylcarboxamido-(1S)-ethylcarboxamido]-2-phenyl-(1R)-ethylcarboxamido]-(2S)-pentanamide Ac-His-DPhe-Arg-Trp-NH2 | CHEMBL264190
TypeSmall organic molecule
Emp. Form.C34H43N11O5
Mol. Mass.685.7759
SMILESCC(=O)N[C@@H](Cc1cnc[nH]1)C(=O)N[C@H](Cc1ccccc1)C(=O)N[C@@H](CCCN=C(N)N)C(=O)N[C@@H](Cc1c[nH]c2ccccc12)C(N)=O