Reaction Details
TargetMelanocortin receptor 3
LigandBDBM50454568
Substrate/Competitorn/a
Meas. Tech.ChEMBL_106014 (CHEMBL716370)
IC50 50±n/a nM
Citation Haskell-Luevano, CHendrata, SNorth, CSawyer, TKHadley, MEHruby, VJDickinson, CGantz, I Discovery of prototype peptidomimetic agonists at the human melanocortin receptors MC1R and MC4R. J Med Chem40:2133-9 (1997) 
 
Melanocortin receptor 3
Name:Melanocortin receptor 3
Type:Enzyme
Mol. Mass.:36044.86
Organism:Homo sapiens (Human)
Description:P41968
Residue:323
BDBM50454568
NameBDBM50454568
Synonyms:CHEMBL263948
TypeSmall organic molecule
Emp. Form.C77H109N21O19S
Mol. Mass.1664.884
SMILESCSCC[C@H](NC(=O)[C@H](CO)NC(=O)[C@H](Cc1ccc(O)cc1)NC(=O)[C@H](CO)NC(C)=O)C(=O)N[C@@H](CCC(O)=O)C(=O)N[C@@H](Cc1c[nH]cn1)C(=O)N[C@H](Cc1ccccc1)C(=O)N[C@@H](CCCN=C(N)N)C(=O)N[C@@H](Cc1c[nH]c2ccccc12)C(=O)NCC(=O)N[C@@H](CCCCN)C(=O)N1CCC[C@H]1C(=O)N[C@@H](C(C)C)C(N)=O