Reaction Details
TargetGag-Pol polyprotein [489-587]
LigandBDBM383
Substrate/Competitorn/a
Meas. Tech.ChEMBL_159286 (CHEMBL764269)
IC50 0.030000±n/a nM
Citation Smith, ABHirschmann, RPasternak, AYao, WSprengeler, PAHolloway, MKKuo, LCChen, ZDarke, PLSchleif, WA An orally bioavailable pyrrolinone inhibitor of HIV-1 protease: computational analysis and X-ray crystal structure of the enzyme complex. J Med Chem40:2440-4 (1997) 
 
Gag-Pol polyprotein [489-587]
Name:Gag-Pol polyprotein [489-587]
Type:Enzyme Subunit
Mol. Mass.:10781.16
Organism:Human immunodeficiency virus type 1
Description:P04585[489-587]
Residue:99
BDBM383
NameBDBM383
Synonyms:(3S)-oxolan-3-yl N-[(2S,3S,5R)-5-benzyl-3-hydroxy-5-{[(1S,2R)-2-hydroxy-2,3-dihydro-1H-inden-1-yl]carbamoyl}-1-phenylpentan-2-yl]carbamate | Urethane deriv. 2
TypeSmall organic molecule
Emp. Form.C33H38N2O6
Mol. Mass.558.6646
SMILESO[C@@H](C[C@@H](Cc1ccccc1)C(=O)N[C@@H]1[C@H](O)Cc2ccccc12)[C@H](Cc1ccccc1)NC(=O)O[C@H]1CCOC1