Reaction Details
TargetTranslocator protein
LigandBDBM50059749
Substrate/Competitorn/a
Meas. Tech.ChEMBL_37036 (CHEMBL650832)
IC50 2.1±n/a nM
Citation Cappelli, AAnzini, MVomero, SDe Benedetti, PGMenziani, MCGiorgi, GManzoni, C Mapping the peripheral benzodiazepine receptor binding site by conformationally restrained derivatives of 1-(2-chlorophenyl)-N-methyl-N-(1-methylpropyl)-3- isoquinolinecarboxamide (PK11195). J Med Chem40:2910-21 (1997) 
 
Translocator protein
Name:Translocator protein
Type:Mitochondrion membrane protein
Mol. Mass.:18945.84
Organism:Rattus norvegicus (rat)
Description:Competitive binding experiments were performed on rat kidney mitochondrial membranes.
Residue:169
BDBM50059749
NameBDBM50059749
Synonyms:3-Methyl-4-phenyl-quinoline-2-carboxylic acid benzyl-methyl-amide | CHEMBL15248
TypeSmall organic molecule
Emp. Form.C25H22N2O
Mol. Mass.366.455
SMILESCN(Cc1ccccc1)C(=O)c1nc2ccccc2c(c1C)-c1ccccc1