Reaction Details
TargetDelta-type opioid receptor
LigandBDBM50059837
Substrate/Competitorn/a
Meas. Tech.ChEMBL_147182 (CHEMBL754481)
Ki 1.6±n/a nM
Citation Tomatis, RMarastoni, MBalboni, GGuerrini, RCapasso, ASorrentino, LSantagada, VCaliendo, GLazarus, LHSalvadori, S Synthesis and pharmacological activity of deltorphin and dermorphin-related glycopeptides. J Med Chem40:2948-52 (1997) 
 
Delta-type opioid receptor
Name:Delta-type opioid receptor
Type:G Protein-Coupled Receptor (GPCR)
Mol. Mass.:40465.04
Organism:Rattus norvegicus (rat)
Description:Competition binding assays were using CHO-K1 cell membranes expressing the opioid receptor.
Residue:372
BDBM50059837
NameBDBM50059837
Synonyms:CHEMBL2370328 | Tyr-D-Ala-Phe-Asp-Val-Val-Thr[Beta-D-Glc]-Gly-NH2
TypeSmall organic molecule
Emp. Form.C47H69N9O17
Mol. Mass.1032.1009
SMILESCC(C)[C@H](NC(=O)[C@H](CC(O)=O)NC(=O)[C@H](Cc1ccccc1)NC(=O)[C@@H](C)NC(=O)[C@@H](N)Cc1ccc(O)cc1)C(=O)N[C@@H](C(C)C)C(=O)N[C@@H]([C@@H](C)O[C@H]1O[C@H](CO)[C@@H](O)[C@H](O)[C@H]1O)C(=O)NCC(N)=O