Reaction Details
TargetMu-type opioid receptor
LigandBDBM50369310
Substrate/Competitorn/a
Meas. Tech.ChEMBL_149142 (CHEMBL759233)
Ki 0.29±n/a nM
Citation Tomatis, RMarastoni, MBalboni, GGuerrini, RCapasso, ASorrentino, LSantagada, VCaliendo, GLazarus, LHSalvadori, S Synthesis and pharmacological activity of deltorphin and dermorphin-related glycopeptides. J Med Chem40:2948-52 (1997) 
 
Mu-type opioid receptor
Name:Mu-type opioid receptor
Type:G Protein-Coupled Receptor (GPCR)
Mol. Mass.:44503.11
Organism:Rattus norvegicus (rat)
Description:Competition binding assays were carried out using membrane preparations from transfected HN9.10 cells that constitutively expressed the mu opioid receptor.
Residue:398
BDBM50369310
NameBDBM50369310
Synonyms:CHEMBL1790778
TypeSmall organic molecule
Emp. Form.C49H65N9O16
Mol. Mass.1036.0911
SMILESC[C@H](O[C@H]1O[C@@H](CO)[C@H](O)[C@@H](O)[C@@H]1O)[C@H](NC(=O)[C@@H]1CCCN1C(=O)[C@H](Cc1ccc(O)cc1)NC(=O)CNC(=O)[C@H](Cc1ccccc1)NC(=O)[C@@H](C)NC(=O)[C@@H](N)Cc1ccc(O)cc1)C(=O)NCC(N)=O