Reaction Details
TargetIntegrase
LigandBDBM50163744
Substrate/Competitorn/a
Meas. Tech.ChEMBL_90720 (CHEMBL701113)
IC50 120000±n/a nM
Citation Mazumder, ANeamati, NSunder, SSchulz, JPertz, HEich, EPommier, Y Curcumin analogs with altered potencies against HIV-1 integrase as probes for biochemical mechanisms of drug action. J Med Chem40:3057-63 (1997) 
 
Integrase
Name:Integrase
Synonyms:Human immunodeficiency virus type 1 integrase
Type:PROTEIN
Mol. Mass.:32231.48
Organism:Human immunodeficiency virus 1
Description:ChEMBL_90865
Residue:288
BDBM50163744
NameBDBM50163744
TypeSmall organic molecule
Emp. Form.C20H18O5
Mol. Mass.338.3539
SMILESCOc1cc(C=CC(=O)CC(=O)C=Cc2ccc(O)cc2)ccc1O