Reaction Details
TargetCoagulation factor X
LigandBDBM50060015
Substrate/Competitorn/a
Meas. Tech.ChEMBL_48481 (CHEMBL662059)
Ki 35000±n/a nM
Citation Stürzebecher, JPrasa, DHauptmann, JVieweg, HWikström, P Synthesis and structure-activity relationships of potent thrombin inhibitors: piperazides of 3-amidinophenylalanine. J Med Chem40:3091-9 (1997) 
 
Coagulation factor X
Name:Coagulation factor X
Type:PROTEIN
Mol. Mass.:54498.45
Organism:Bos taurus
Description:ChEMBL_1364435
Residue:492
BDBM50060015
NameBDBM50060015
Synonyms:3-[3-[4-(2-Hydroxy-ethyl)-piperazin-1-yl]-2-(naphthalene-2-sulfonylamino)-3-oxo-propyl]-benzamidine | CHEMBL104872
TypeSmall organic molecule
Emp. Form.C26H31N5O4S
Mol. Mass.509.62
SMILESNC(=N)c1cccc(CC(NS(=O)(=O)c2ccc3ccccc3c2)C(=O)N2CCN(CCO)CC2)c1