Reaction Details
TargetAnionic trypsin
LigandBDBM50060019
Substrate/Competitorn/a
Meas. Tech.ChEMBL_212519 (CHEMBL817584)
Ki 320±n/a nM
Citation Stürzebecher, JPrasa, DHauptmann, JVieweg, HWikström, P Synthesis and structure-activity relationships of potent thrombin inhibitors: piperazides of 3-amidinophenylalanine. J Med Chem40:3091-9 (1997) 
 
Anionic trypsin
Name:Anionic trypsin
Type:PROTEIN
Mol. Mass.:26281.39
Organism:Bos taurus
Description:ChEMBL_212177
Residue:247
BDBM50060019
NameBDBM50060019
Synonyms:3-[(R)-3-(4-Methanesulfonyl-piperazin-1-yl)-3-oxo-2-(2,2,5,7,8-pentamethyl-chroman-6-sulfonylamino)-propyl]-benzamidine | CHEMBL107743
TypeSmall organic molecule
Emp. Form.C29H41N5O6S2
Mol. Mass.619.796
SMILESCc1c(C)c(c(C)c2CCC(C)(C)Oc12)S(=O)(=O)N[C@H](Cc1cccc(c1)C(N)=N)C(=O)N1CCN(CC1)S(C)(=O)=O