Reaction Details
TargetVitamin K-dependent protein C
LigandBDBM50060017
Substrate/Competitorn/a
Meas. Tech.ChEMBL_27847 (CHEMBL642272)
Ki 15200±n/a nM
Citation Stürzebecher, JPrasa, DHauptmann, JVieweg, HWikström, P Synthesis and structure-activity relationships of potent thrombin inhibitors: piperazides of 3-amidinophenylalanine. J Med Chem40:3091-9 (1997) 
 
Vitamin K-dependent protein C
Name:Vitamin K-dependent protein C
Type:Enzyme
Mol. Mass.:52067.73
Organism:Homo sapiens (Human)
Description:n/a
Residue:461
BDBM50060017
NameBDBM50060017
Synonyms:3-[(R)-3-(4-Methanesulfonyl-piperazin-1-yl)-2-(naphthalene-2-sulfonylamino)-3-oxo-propyl]-benzamidine | CHEMBL107392
TypeSmall organic molecule
Emp. Form.C25H29N5O5S2
Mol. Mass.543.658
SMILESCS(=O)(=O)N1CCN(CC1)C(=O)[C@@H](Cc1cccc(c1)C(N)=N)NS(=O)(=O)c1ccc2ccccc2c1