Reaction Details
TargetProthrombin
LigandBDBM50060042
Substrate/Competitorn/a
Meas. Tech.ChEMBL_210595 (CHEMBL816562)
Ki 460±n/a nM
Citation Stürzebecher, JPrasa, DHauptmann, JVieweg, HWikström, P Synthesis and structure-activity relationships of potent thrombin inhibitors: piperazides of 3-amidinophenylalanine. J Med Chem40:3091-9 (1997) 
 
Prothrombin
Name:Prothrombin
Type:Enzyme
Mol. Mass.:70502.73
Organism:Bos taurus (Bovine)
Description:P00735
Residue:625
BDBM50060042
NameBDBM50060042
Synonyms:3-[3-[4-(Naphthalene-2-carbonyl)-piperazin-1-yl]-2-(naphthalene-2-sulfonylamino)-3-oxo-propyl]-benzamidine | CHEMBL105569
TypeSmall organic molecule
Emp. Form.C35H33N5O4S
Mol. Mass.619.733
SMILESNC(=N)c1cccc(CC(NS(=O)(=O)c2ccc3ccccc3c2)C(=O)N2CCN(CC2)C(=O)c2ccc3ccccc3c2)c1