Reaction Details
TargetProthrombin
LigandBDBM50037996
Substrate/Competitorn/a
Meas. Tech.ChEMBL_210595 (CHEMBL816562)
Ki 6±n/a nM
Citation Stürzebecher, JPrasa, DHauptmann, JVieweg, HWikström, P Synthesis and structure-activity relationships of potent thrombin inhibitors: piperazides of 3-amidinophenylalanine. J Med Chem40:3091-9 (1997) 
 
Prothrombin
Name:Prothrombin
Type:Enzyme
Mol. Mass.:70502.73
Organism:Bos taurus (Bovine)
Description:P00735
Residue:625
BDBM50037996
NameBDBM50037996
Synonyms:1-[N-(naphthalen-2-ylsulfonyl)glycyl-4-carbamimidoyl-D-phenylalanyl]piperidine N-[(R)-1-(4-Carbamimidoyl-benzyl)-2-oxo-2-piperidin-1-yl-ethyl]-2-(naphthalene-2-sulfonylamino)-acetamide N-[1-(4-Carbamimidoyl-benzyl)-2-oxo-2-piperidin-1-yl-ethyl]-2-(naphthalene-2-sulfonylamino)-acetamide | N-[1-(4-Carbamimidoyl-benzyl)-2-oxo-2-piperidin-1-yl-ethyl]-2-(naphthalene-2-sulfonylamino)-acetamide(NAPAP)
TypeSmall organic molecule
Emp. Form.C27H31N5O4S
Mol. Mass.521.631
SMILESNC(=N)c1ccc(C[C@@H](NC(=O)CNS(=O)(=O)c2ccc3ccccc3c2)C(=O)N2CCCCC2)cc1