Reaction Details
TargetPlasminogen
LigandBDBM50060023
Substrate/Competitorn/a
Meas. Tech.ChEMBL_155245 (CHEMBL764734)
Ki 3300±n/a nM
Citation Stürzebecher, JPrasa, DHauptmann, JVieweg, HWikström, P Synthesis and structure-activity relationships of potent thrombin inhibitors: piperazides of 3-amidinophenylalanine. J Med Chem40:3091-9 (1997) 
 
Plasminogen
Name:Plasminogen
Type:Enzyme
Mol. Mass.:90579.18
Organism:Homo sapiens (Human)
Description:n/a
Residue:810
BDBM50060023
NameBDBM50060023
Synonyms:3-[(R)-3-(4-Formyl-piperazin-1-yl)-2-(naphthalene-2-sulfonylamino)-3-oxo-propyl]-benzamidine | CHEMBL322165
TypeSmall organic molecule
Emp. Form.C25H27N5O4S
Mol. Mass.493.578
SMILESNC(=N)c1cccc(C[C@@H](NS(=O)(=O)c2ccc3ccccc3c2)C(=O)N2CCN(CC2)C=O)c1