Reaction Details
TargetAnionic trypsin
LigandBDBM50060035
Substrate/Competitorn/a
Meas. Tech.ChEMBL_212519 (CHEMBL817584)
Ki 97±n/a nM
Citation Stürzebecher, JPrasa, DHauptmann, JVieweg, HWikström, P Synthesis and structure-activity relationships of potent thrombin inhibitors: piperazides of 3-amidinophenylalanine. J Med Chem40:3091-9 (1997) 
 
Anionic trypsin
Name:Anionic trypsin
Type:PROTEIN
Mol. Mass.:26281.39
Organism:Bos taurus
Description:ChEMBL_212177
Residue:247
BDBM50060035
NameBDBM50060035
Synonyms:4-[(R)-3-(3-Carbamimidoyl-phenyl)-2-(naphthalene-2-sulfonylamino)-propionyl]-piperazine-1-carboxylic acid dimethylamide | CHEMBL107627
TypeSmall organic molecule
Emp. Form.C27H32N6O4S
Mol. Mass.536.646
SMILESCN(C)C(=O)N1CCN(CC1)C(=O)[C@@H](Cc1cccc(c1)C(N)=N)NS(=O)(=O)c1ccc2ccccc2c1