Reaction Details
TargetProthrombin
LigandBDBM50060024
Substrate/Competitorn/a
Meas. Tech.ChEMBL_210595 (CHEMBL816562)
Ki 37±n/a nM
Citation Stürzebecher, JPrasa, DHauptmann, JVieweg, HWikström, P Synthesis and structure-activity relationships of potent thrombin inhibitors: piperazides of 3-amidinophenylalanine. J Med Chem40:3091-9 (1997) 
 
Prothrombin
Name:Prothrombin
Type:Enzyme
Mol. Mass.:70502.73
Organism:Bos taurus (Bovine)
Description:P00735
Residue:625
BDBM50060024
NameBDBM50060024
Synonyms:3-[(R)-3-[4-(2-Hydroxy-ethyl)-piperazin-1-yl]-2-(naphthalene-2-sulfonylamino)-3-oxo-propyl]-benzamidine | CHEMBL107282
TypeSmall organic molecule
Emp. Form.C26H31N5O4S
Mol. Mass.509.62
SMILESNC(=N)c1cccc(C[C@@H](NS(=O)(=O)c2ccc3ccccc3c2)C(=O)N2CCN(CCO)CC2)c1