Reaction Details
TargetAnionic trypsin
LigandBDBM50060051
Substrate/Competitorn/a
Meas. Tech.ChEMBL_212519 (CHEMBL817584)
Ki 140±n/a nM
Citation Stürzebecher, JPrasa, DHauptmann, JVieweg, HWikström, P Synthesis and structure-activity relationships of potent thrombin inhibitors: piperazides of 3-amidinophenylalanine. J Med Chem40:3091-9 (1997) 
 
Anionic trypsin
Name:Anionic trypsin
Type:PROTEIN
Mol. Mass.:26281.39
Organism:Bos taurus
Description:ChEMBL_212177
Residue:247
BDBM50060051
NameBDBM50060051
Synonyms:3-[3-(4-Acetyl-piperazin-1-yl)-2-(naphthalene-2-sulfonylamino)-3-oxo-propyl]-benzamidine | CHEMBL107188
TypeSmall organic molecule
Emp. Form.C26H29N5O4S
Mol. Mass.507.605
SMILESCC(=O)N1CCN(CC1)C(=O)C(Cc1cccc(c1)C(N)=N)NS(=O)(=O)c1ccc2ccccc2c1