Reaction Details
TargetAnionic trypsin
LigandBDBM50060042
Substrate/Competitorn/a
Meas. Tech.ChEMBL_212519 (CHEMBL817584)
Ki 190±n/a nM
Citation Stürzebecher, JPrasa, DHauptmann, JVieweg, HWikström, P Synthesis and structure-activity relationships of potent thrombin inhibitors: piperazides of 3-amidinophenylalanine. J Med Chem40:3091-9 (1997) 
 
Anionic trypsin
Name:Anionic trypsin
Type:PROTEIN
Mol. Mass.:26281.39
Organism:Bos taurus
Description:ChEMBL_212177
Residue:247
BDBM50060042
NameBDBM50060042
Synonyms:3-[3-[4-(Naphthalene-2-carbonyl)-piperazin-1-yl]-2-(naphthalene-2-sulfonylamino)-3-oxo-propyl]-benzamidine | CHEMBL105569
TypeSmall organic molecule
Emp. Form.C35H33N5O4S
Mol. Mass.619.733
SMILESNC(=N)c1cccc(CC(NS(=O)(=O)c2ccc3ccccc3c2)C(=O)N2CCN(CC2)C(=O)c2ccc3ccccc3c2)c1