Reaction Details
TargetMu-type opioid receptor
LigandBDBM50060079
Substrate/Competitorn/a
Meas. Tech.ChEMBL_148849 (CHEMBL756645)
Ki 11523±n/a nM
Citation Salvadori, SBalboni, GGuerrini, RTomatis, RBianchi, CBryant, SDCooper, PSLazarus, LH Evolution of the Dmt-Tic pharmacophore: N-terminal methylated derivatives with extraordinary delta opioid antagonist activity. J Med Chem40:3100-8 (1997) 
 
Mu-type opioid receptor
Name:Mu-type opioid receptor
Type:G Protein-Coupled Receptor (GPCR)
Mol. Mass.:44503.11
Organism:Rattus norvegicus (rat)
Description:Competition binding assays were carried out using membrane preparations from transfected HN9.10 cells that constitutively expressed the mu opioid receptor.
Residue:398
BDBM50060079
NameBDBM50060079
Synonyms:2-[(S)-2-Dimethylamino-3-(4-hydroxy-phenyl)-propionyl]-1,2,3,4-tetrahydro-isoquinoline-3-carboxylic acid | CHEMBL104705
TypeSmall organic molecule
Emp. Form.C21H24N2O4
Mol. Mass.368.4263
SMILESCN(C)[C@@H](Cc1ccc(O)cc1)C(=O)N1Cc2ccccc2CC1C(O)=O