Reaction Details
TargetDelta-type opioid receptor
LigandBDBM50060082
Substrate/Competitorn/a
Meas. Tech.ChEMBL_146908 (CHEMBL751121)
Ki 0.136000±n/a nM
Citation Salvadori, SBalboni, GGuerrini, RTomatis, RBianchi, CBryant, SDCooper, PSLazarus, LH Evolution of the Dmt-Tic pharmacophore: N-terminal methylated derivatives with extraordinary delta opioid antagonist activity. J Med Chem40:3100-8 (1997) 
 
Delta-type opioid receptor
Name:Delta-type opioid receptor
Type:G Protein-Coupled Receptor (GPCR)
Mol. Mass.:40465.04
Organism:Rattus norvegicus (rat)
Description:Competition binding assays were using CHO-K1 cell membranes expressing the opioid receptor.
Residue:372
BDBM50060082
NameBDBM50060082
Synonyms:2-({2-[(S)-3-(4-Hydroxy-2,6-dimethyl-phenyl)-2-methylamino-propionyl]-1,2,3,4-tetrahydro-isoquinoline-3-carbonyl}-amino)-propionic acid | CHEMBL2370386
TypeSmall organic molecule
Emp. Form.C26H33N3O5
Mol. Mass.467.5573
SMILESC[C@H](NC(=O)[C@@H]1Cc2ccccc2CN1C(=O)[C@H](Cc1c(C)cc(O)cc1C)N(C)C)C(O)=O