Reaction Details
TargetDelta-type opioid receptor
LigandBDBM50061062
Substrate/Competitorn/a
Meas. Tech.ChEMBL_146321 (CHEMBL757530)
Ki 7.1±n/a nM
Citation Dondio, GRonzoni, SEggleston, DSArtico, MPetrillo, PPetrone, GVisentin, LFarina, CVecchietti, VClarke, GD Discovery of a novel class of substituted pyrrolooctahydroisoquinolines as potent and selective delta opioid agonists, based on an extension of the message-address concept. J Med Chem40:3192-8 (1997) 
 
Delta-type opioid receptor
Name:Delta-type opioid receptor
Type:Enzyme Catalytic Domain
Mol. Mass.:40577.25
Organism:MOUSE
Description:P32300
Residue:372
BDBM50061062
NameBDBM50061062
Synonyms:3-((4aS,11aR)-2-Ethyl-1,2,3,4,5,6,11,11a-octahydro-pyrido[4,3-b]carbazol-4a-yl)-phenol | CHEMBL107670
TypeSmall organic molecule
Emp. Form.C23H26N2O
Mol. Mass.346.4653
SMILESCCN1CC[C@@]2(Cc3[nH]c4ccccc4c3C[C@H]2C1)c1cccc(O)c1