Reaction Details
TargetDelta-type opioid receptor
LigandBDBM21864
Substrate/Competitorn/a
Meas. Tech.ChEMBL_146321 (CHEMBL757530)
Ki 0.50±n/a nM
Citation Dondio, GRonzoni, SEggleston, DSArtico, MPetrillo, PPetrone, GVisentin, LFarina, CVecchietti, VClarke, GD Discovery of a novel class of substituted pyrrolooctahydroisoquinolines as potent and selective delta opioid agonists, based on an extension of the message-address concept. J Med Chem40:3192-8 (1997) 
 
Delta-type opioid receptor
Name:Delta-type opioid receptor
Type:Enzyme Catalytic Domain
Mol. Mass.:40577.25
Organism:MOUSE
Description:P32300
Residue:372
BDBM21864
NameBDBM21864
Synonyms:(21R)-22-(cyclopropylmethyl)-14-oxa-11,22-diazaheptacyclo[13.9.1.0^{1,13}.0^{2,21}.0^{4,12}.0^{5,10}.0^{19,25}]pentacosa-4(12),5,7,9,15,17,19(25)-heptaene-2,16-diol NALTRINDOLE | [3H]-naltrindole
Typeradiolabeled ligand
Emp. Form.C26H26N2O3
Mol. Mass.414.4962
SMILES[H][C@@]12Cc3ccc(O)c4OC5c6[nH]c7ccccc7c6CC1(O)C5(CCN2CC1CC1)c34