Reaction Details
TargetP-selectin
LigandBDBM50061122
Substrate/Competitorn/a
Meas. Tech.ChEMBL_200027 (CHEMBL810716)
IC50 900±n/a nM
Citation Marinier, AMartel, ABanville, JBachand, CRemillard, RLapointe, PTurmel, BMenard, MHarte, WEWright, JJTodderud, GTramposch, KMBajorath, JHollenbaugh, DAruffo, A Sulfated galactocerebrosides as potential antiinflammatory agents. J Med Chem40:3234-47 (1997) 
 
P-selectin
Name:P-selectin
Type:PROTEIN
Mol. Mass.:90834.61
Organism:Homo sapiens (Human)
Description:ChEMBL_1438999
Residue:830
BDBM50061122
NameBDBM50061122
Synonyms:(2S,3R,4E)-2-(Hexadecanoylamino)-3-(benzoyloxy)-1-[[2,6-bis-O-(sodium oxysulfonyl)-beta-D-galactopyranosyl]oxy]-4-octadecene | CHEMBL322096
TypeSmall organic molecule
Emp. Form.C47H81NO14S2
Mol. Mass.948.275
(=O)N[C@@H](COC1OC(COS([O-])(=O)=O)C(O)C(O)C1OS([O-])(=O)=O)[C@H](OCc1ccccc1)\C=C\CCCCCCCCCCCCC