Reaction Details
TargetP-selectin
LigandBDBM50061128
Substrate/Competitorn/a
Meas. Tech.ChEMBL_200027 (CHEMBL810716)
IC50 640±n/a nM
Citation Marinier, AMartel, ABanville, JBachand, CRemillard, RLapointe, PTurmel, BMenard, MHarte, WEWright, JJTodderud, GTramposch, KMBajorath, JHollenbaugh, DAruffo, A Sulfated galactocerebrosides as potential antiinflammatory agents. J Med Chem40:3234-47 (1997) 
 
P-selectin
Name:P-selectin
Type:PROTEIN
Mol. Mass.:90834.61
Organism:Homo sapiens (Human)
Description:ChEMBL_1438999
Residue:830
BDBM50061128
NameBDBM50061128
Synonyms:1N-[2-hydroxy-1-(5-hydroxy-6-hydroxymethyltetrahydro-2H-2-pyranyloxymethyl)-(1S,2R,3E)-3-heptadecenyl]hexadecanamide sodium sulfatide | CHEMBL326754
TypeSmall organic molecule
Emp. Form.C40H76NO10S
Mol. Mass.763.098
(=O)N[C@@H](COC1CC(OS([O-])(=O)=O)C(O)C(CO)O1)[C@H](O)\C=C\CCCCCCCCCCCCC