Reaction Details
TargetP-selectin
LigandBDBM50061130
Substrate/Competitorn/a
Meas. Tech.ChEMBL_200027 (CHEMBL810716)
IC50 100±n/a nM
Citation Marinier, AMartel, ABanville, JBachand, CRemillard, RLapointe, PTurmel, BMenard, MHarte, WEWright, JJTodderud, GTramposch, KMBajorath, JHollenbaugh, DAruffo, A Sulfated galactocerebrosides as potential antiinflammatory agents. J Med Chem40:3234-47 (1997) 
 
P-selectin
Name:P-selectin
Type:PROTEIN
Mol. Mass.:90834.61
Organism:Homo sapiens (Human)
Description:ChEMBL_1438999
Residue:830
BDBM50061130
NameBDBM50061130
Synonyms:(2S,3R,4E)-3-(Benzoyloxy)-2-(hexadecanoylamino)-1-[[2,3-bis-O-(sodium oxysulfonyl)-4,6-O-benzylidene-beta-D-galactopyranosyl]oxy]-4-octadecene | CHEMBL438774
TypeSmall organic molecule
Emp. Form.C54H85NO14S2
Mol. Mass.1036.382
(=O)N[C@@H](COC1OC2COC(OC2C(OS([O-])(=O)=O)C1OS([O-])(=O)=O)c1ccccc1)[C@H](OCc1ccccc1)\C=C\CCCCCCCCCCCCC