Reaction Details
TargetCannabinoid receptor 1
LigandBDBM50060605
Substrate/Competitorn/a
Meas. Tech.ChEMBL_46613 (CHEMBL875534)
Ki 7±n/a nM
Citation Ryan, WJBanner, WKWiley, JLMartin, BRRazdan, RK Potent anandamide analogs: the effect of changing the length and branching of the end pentyl chain. J Med Chem40:3617-25 (1997) 
 
Cannabinoid receptor 1
Name:Cannabinoid receptor 1
Type:Enzyme
Mol. Mass.:52842.52
Organism:Mus musculus (Mouse)
Description:P47746
Residue:473
BDBM50060605
NameBDBM50060605
Synonyms:(5Z,8Z,11Z,14Z)-16,16-Dimethyl-docosa-5,8,11,14-tetraenoic acid (2-hydroxy-ethyl)-amide | CHEMBL120889
TypeSmall organic molecule
Emp. Form.C26H45NO2
Mol. Mass.403.641
SMILESCCCCCCC(C)(C)\C=C/C\C=C/C\C=C/C\C=C/CCCC(=O)NCCO