Reaction Details
TargetGlutamate receptor ionotropic, kainate 5
LigandBDBM50060632
Substrate/Competitorn/a
Meas. Tech.ChEMBL_90444 (CHEMBL698076)
Ki 57±n/a nM
Citation Jane, DEHoo, KKamboj, RDeverill, MBleakman, DMandelzys, A Synthesis of willardiine and 6-azawillardiine analogs: pharmacological characterization on cloned homomeric human AMPA and kainate receptor subtypes. J Med Chem40:3645-50 (1997) 
 
Glutamate receptor ionotropic, kainate 5
Name:Glutamate receptor ionotropic, kainate 5
Type:Enzyme Catalytic Domain
Mol. Mass.:109280.81
Organism:Homo sapiens (Human)
Description:Glutamate-Kainate 5 Grik5 HUMAN::Q16478
Residue:980
BDBM50060632
NameBDBM50060632
Synonyms:(S)-2-Amino-3-(5-chloro-2,4-dioxo-3,4-dihydro-2H-pyrimidin-1-yl)-propionic acid CHEMBL121388
TypeSmall organic molecule
Emp. Form.C7H8ClN3O4
Mol. Mass.233.609
SMILESN[C@@H](Cn1cc(Cl)c(=O)[nH]c1=O)C(O)=O