Reaction Details
TargetGlutamate receptor 2
LigandBDBM50060631
Substrate/Competitorn/a
Meas. Tech.ChEMBL_90152 (CHEMBL696974)
Ki 115±n/a nM
Citation Jane, DEHoo, KKamboj, RDeverill, MBleakman, DMandelzys, A Synthesis of willardiine and 6-azawillardiine analogs: pharmacological characterization on cloned homomeric human AMPA and kainate receptor subtypes. J Med Chem40:3645-50 (1997) 
 
Glutamate receptor 2
Name:Glutamate receptor 2
Type:Enzyme Catalytic Domain
Mol. Mass.:98825.96
Organism:Homo sapiens (Human)
Description:Glutamate AMPA 2 GRIA2 HUMAN::P42262
Residue:883
BDBM50060631
NameBDBM50060631
Synonyms:(S)-2-Amino-3-(5-nitro-2,4-dioxo-3,4-dihydro-2H-pyrimidin-1-yl)-propionic acid | CHEMBL121191
TypeSmall organic molecule
Emp. Form.C7H8N4O6
Mol. Mass.244.1616
SMILESN[C@@H](Cn1cc([N+]([O-])=O)c(=O)[nH]c1=O)C(O)=O