Reaction Details
TargetGlutamate receptor 2
LigandBDBM50060635
Substrate/Competitorn/a
Meas. Tech.ChEMBL_90152 (CHEMBL696974)
Ki 25±n/a nM
Citation Jane, DEHoo, KKamboj, RDeverill, MBleakman, DMandelzys, A Synthesis of willardiine and 6-azawillardiine analogs: pharmacological characterization on cloned homomeric human AMPA and kainate receptor subtypes. J Med Chem40:3645-50 (1997) 
 
Glutamate receptor 2
Name:Glutamate receptor 2
Type:Enzyme Catalytic Domain
Mol. Mass.:98825.96
Organism:Homo sapiens (Human)
Description:Glutamate AMPA 2 GRIA2 HUMAN::P42262
Residue:883
BDBM50060635
NameBDBM50060635
Synonyms:(S)-2-Amino-3-(5-fluoro-2,4-dioxo-3,4-dihydro-2H-pyrimidin-1-yl)-propionic acid (S)-5-Fluorowillardiine CHEMBL123132 | Fluorowillardiine
TypeSmall organic molecule
Emp. Form.C7H8FN3O4
Mol. Mass.217.1545
SMILESN[C@@H](Cn1cc(F)c(=O)[nH]c1=O)C(O)=O