Reaction Details
TargetGlutamate receptor 1
LigandBDBM50060630
Substrate/Competitorn/a
Meas. Tech.ChEMBL_90141 (CHEMBL878883)
Ki 29±n/a nM
Citation Jane, DEHoo, KKamboj, RDeverill, MBleakman, DMandelzys, A Synthesis of willardiine and 6-azawillardiine analogs: pharmacological characterization on cloned homomeric human AMPA and kainate receptor subtypes. J Med Chem40:3645-50 (1997) 
 
Glutamate receptor 1
Name:Glutamate receptor 1
Type:Enzyme Catalytic Domain
Mol. Mass.:101512.92
Organism:Homo sapiens (Human)
Description:Glutamate AMPA 1 GRIA1 HUMAN::P42261
Residue:906
BDBM50060630
NameBDBM50060630
Synonyms:(S)-2-Amino-3-(6-bromo-3,5-dioxo-4,5-dihydro-3H-[1,2,4]triazin-2-yl)-propionic acid | CHEMBL331644
TypeSmall organic molecule
Emp. Form.C6H7BrN4O4
Mol. Mass.279.048
SMILESN[C@@H](Cn1nc(Br)c(=O)[nH]c1=O)C(O)=O