Reaction Details
TargetPlasma kallikrein
LigandBDBM50060703
Substrate/Competitorn/a
Meas. Tech.ChEMBL_92238 (CHEMBL703583)
Ki>1000000±n/a nM
Citation Tucker, TJLumma, WCLewis, SDGardell, SJLucas, BJSisko, JTLynch, JJLyle, EABaskin, EPWoltmann, RFAppleby, SDChen, IWDancheck, KBNaylor-Olsen, AMKrueger, JACooper, CMVacca, JP Synthesis of a series of potent and orally bioavailable thrombin inhibitors that utilize 3,3-disubstituted propionic acid derivatives in the P3 position. J Med Chem40:3687-93 (1997) 
 
Plasma kallikrein
Name:Plasma kallikrein
Type:Protein
Mol. Mass.:71391.16
Organism:Homo sapiens (Human)
Description:P03952
Residue:638
BDBM50060703
NameBDBM50060703
Synonyms:(S)-1-(3-Phenyl-3-pyridin-4-yl-propionyl)-pyrrolidine-2-carboxylic acid (4-amino-cyclohexylmethyl)-amide; TFA | CHEMBL431675
TypeSmall organic molecule
Emp. Form.C26H34N4O2
Mol. Mass.434.5738
SMILESNC1CCC(CNC(=O)[C@@H]2CCCN2C(=O)CC(c2ccccc2)c2ccncc2)CC1