Reaction Details
TargetPlasminogen
LigandBDBM50060708
Substrate/Competitorn/a
Meas. Tech.ChEMBL_155252 (CHEMBL764405)
Ki 572000±n/a nM
Citation Tucker, TJLumma, WCLewis, SDGardell, SJLucas, BJSisko, JTLynch, JJLyle, EABaskin, EPWoltmann, RFAppleby, SDChen, IWDancheck, KBNaylor-Olsen, AMKrueger, JACooper, CMVacca, JP Synthesis of a series of potent and orally bioavailable thrombin inhibitors that utilize 3,3-disubstituted propionic acid derivatives in the P3 position. J Med Chem40:3687-93 (1997) 
 
Plasminogen
Name:Plasminogen
Type:Enzyme
Mol. Mass.:90579.18
Organism:Homo sapiens (Human)
Description:n/a
Residue:810
BDBM50060708
NameBDBM50060708
Synonyms:(S)-1-(3-Benzo[1,3]dioxol-5-yl-3-pyridin-3-yl-propionyl)-pyrrolidine-2-carboxylic acid (4-amino-cyclohexylmethyl)-amide; TFA | CHEMBL330791
TypeSmall organic molecule
Emp. Form.C27H34N4O4
Mol. Mass.478.5833
SMILESNC1CCC(CNC(=O)[C@@H]2CCCN2C(=O)CC(c2cccnc2)c2ccc3OCOc3c2)CC1