Reaction Details
TargetAdenosine receptor A1
LigandBDBM50060845
Substrate/Competitorn/a
Meas. Tech.ChEMBL_28847 (CHEMBL646709)
Ki 83±n/a nM
Citation Van Calenbergh, Svon Frijtag Drabbe Künzel, JKBlaton, NMPeeters, OMRozenski, JVan Aerschot, ADe Bruyn, ADe Keukeleire, DIJzerman, APHerdewijn, P N6-cyclopentyl-3'-substituted-xylofuranosyladenosines: a new class of non-xanthine adenosine A1 receptor antagonists. J Med Chem40:3765-72 (1997) 
 
Adenosine receptor A1
Name:Adenosine receptor A1
Type:Protein
Mol. Mass.:36704.13
Organism:Rattus norvegicus (rat)
Description:n/a
Residue:326
BDBM50060845
NameBDBM50060845
Synonyms:CHEMBL122746 | N-[(R)-5-(6-Cyclopentylamino-purin-9-yl)-4-hydroxy-2-hydroxymethyl-tetrahydro-furan-3-yl]-4-methyl-benzamide
TypeSmall organic molecule
Emp. Form.C23H28N6O4
Mol. Mass.452.5062
SMILESCc1ccc(cc1)C(=O)N[C@H]1C(CO)OC(C1O)n1cnc2c(NC3CCCC3)ncnc12