Reaction Details
TargetAdenosine receptor A1
LigandBDBM50112193
Substrate/Competitorn/a
Meas. Tech.ChEMBL_28847 (CHEMBL646709)
Ki 24±n/a nM
Citation Van Calenbergh, Svon Frijtag Drabbe Künzel, JKBlaton, NMPeeters, OMRozenski, JVan Aerschot, ADe Bruyn, ADe Keukeleire, DIJzerman, APHerdewijn, P N6-cyclopentyl-3'-substituted-xylofuranosyladenosines: a new class of non-xanthine adenosine A1 receptor antagonists. J Med Chem40:3765-72 (1997) 
 
Adenosine receptor A1
Name:Adenosine receptor A1
Type:Protein
Mol. Mass.:36704.13
Organism:Rattus norvegicus (rat)
Description:n/a
Residue:326
BDBM50112193
NameBDBM50112193
Synonyms:CHEMBL52648 | N-[5-(6-Cyclopentylamino-purin-9-yl)-4-hydroxy-2-hydroxymethyl-tetrahydro-furan-3-yl]-3,4-dimethyl-benzamide
TypeSmall organic molecule
Emp. Form.C24H30N6O4
Mol. Mass.466.5328
SMILESCc1ccc(cc1C)C(=O)N[C@H]1[C@@H](CO)O[C@H]([C@@H]1O)n1cnc2c(NC3CCCC3)ncnc12