Reaction Details
TargetNitric oxide synthase, endothelial
LigandBDBM50061230
Substrate/Competitorn/a
Meas. Tech.ChEMBL_65145 (CHEMBL678113)
Ki 3100±n/a nM
Citation Zhang, HQFast, WMarletta, MAMartasek, PSilverman, RB Potent and selective inhibition of neuronal nitric oxide synthase by N omega-propyl-L-arginine. J Med Chem40:3869-70 (1998) 
 
Nitric oxide synthase, endothelial
Name:Nitric oxide synthase, endothelial
Type:Enzyme
Mol. Mass.:133292.26
Organism:Bos taurus (bovine)
Description:Recombinant eNOS overexpressed in E. coli was used in enzyme assays.
Residue:1205
BDBM50061230
NameBDBM50061230
Synonyms:1-Acetyl-4-(N'-allyl-guanidino)-butyl-ammonium
TypeSmall organic molecule
Emp. Form.C10H21N4O
Mol. Mass.213.2994
SMILESCC(=O)C([NH3+])CCCNC(=N)NCC=C