Reaction Details
TargetGag-Pol polyprotein [489-587]
LigandBDBM50061306
Substrate/Competitorn/a
Meas. Tech.ChEMBL_157727 (CHEMBL763400)
Ki 2±n/a nM
Citation Kaldor, SWKalish, VJDavies, JFShetty, BVFritz, JEAppelt, KBurgess, JACampanale, KMChirgadze, NYClawson, DKDressman, BAHatch, SDKhalil, DAKosa, MBLubbehusen, PPMuesing, MAPatick, AKReich, SHSu, KSTatlock, JH Viracept (nelfinavir mesylate, AG1343): a potent, orally bioavailable inhibitor of HIV-1 protease. J Med Chem40:3979-85 (1998) 
 
Gag-Pol polyprotein [489-587]
Name:Gag-Pol polyprotein [489-587]
Type:Enzyme Subunit
Mol. Mass.:10781.16
Organism:Human immunodeficiency virus type 1
Description:P04585[489-587]
Residue:99
BDBM50061306
NameBDBM50061306
Synonyms:(3S,4aS,8aS)-2-[(2R,3R)-2-Hydroxy-3-(3-hydroxy-2-methyl-benzoylamino)-4-phenylsulfanyl-butyl]-decahydro-isoquinoline-3-carboxylic acid tert-butylamide; compound with methanesulfonic acid CHEMBL1205 Nelfinavir cmdc.202100576, 24h
TypeSmall organic molecule
Emp. Form.C32H45N3O4S
Mol. Mass.567.782
SMILESCc1c(O)cccc1C(=O)N[C@@H](CSc1ccccc1)[C@H](O)CN1C[C@H]2CCCC[C@H]2C[C@H]1C(=O)NC(C)(C)C