Reaction Details
TargetNeuronal acetylcholine receptor subunit alpha-4/beta-2
LigandBDBM50023330
Substrate/Competitorn/a
Meas. Tech.ChEMBL_143564 (CHEMBL755336)
EC50 48±n/a nM
Citation Holladay, MWDart, MJLynch, JK Neuronal nicotinic acetylcholine receptors as targets for drug discovery. J Med Chem40:4169-94 (1998) 
 
Neuronal acetylcholine receptor subunit alpha-4/beta-2
Name:Neuronal acetylcholine receptor subunit alpha-4/beta-2
Type:n/a
Mol. Mass.:n/a
Description:n/a
Components:This complex has 0 components.
Component 1
Name:Neuronal acetylcholine receptor subunit alpha-4
Synonyms:ACHA4_RAT Cholinergic, Nicotinic Alpha4Beta2 Chrna4 Neuronal acetylcholine receptor (alpha4beta2 nAChR) Neuronal acetylcholine receptor subunit alpha 4 beta 2 | Neuronal acetylcholine receptor subunit alpha-4
Type:Enzyme
Mol. Mass.:70196.44
Organism:Rattus norvegicus (Rat)
Description:P09483
Residue:630
Component 2
Name:Neuronal acetylcholine receptor subunit beta-2
Synonyms:ACHB2_RAT Chrnb2 Neuronal acetylcholine receptor non-alpha-1 chain
Type:Enzyme
Mol. Mass.:56910.32
Organism:Rattus norvegicus (Rat)
Description:P12390
Residue:500
BDBM50023330
NameBDBM50023330
Synonyms:1-(9-Aza-bicyclo[4.2.1]non-2-en-2-yl)-ethanone Anatoxin-A,(+) CHEMBL25619
TypeSmall organic molecule
Emp. Form.C10H15NO
Mol. Mass.165.2322
SMILESCC(=O)C1=CCCC2CCC1N2