Reaction Details
TargetNeuronal acetylcholine receptor subunit alpha-4/beta-2
LigandBDBM50049756
Substrate/Competitorn/a
Meas. Tech.ChEMBL_143543 (CHEMBL754721)
EC50 750±n/a nM
Citation Holladay, MWDart, MJLynch, JK Neuronal nicotinic acetylcholine receptors as targets for drug discovery. J Med Chem40:4169-94 (1998) 
 
Neuronal acetylcholine receptor subunit alpha-4/beta-2
Name:Neuronal acetylcholine receptor subunit alpha-4/beta-2
Type:Protein
Mol. Mass.:n/a
Description:n/a
Components:This complex has 2 components.
Component 1
Name:Neuronal acetylcholine receptor subunit alpha-4
Synonyms:ACHA4_HUMAN CHRNA4 protein Neuronal acetylcholine receptor protein alpha-4 subunit Nicotinic acetylcholine receptor alpha4/beta2/alpha5
Type:n/a
Mol. Mass.:69963.49
Organism:Homo sapiens (Human)
Description:NACHRA4
Residue:627
Component 2
Name:Neuronal acetylcholine receptor subunit beta-2
Synonyms:ACHB2_HUMAN Neuronal acetylcholine receptor protein beta-2 subunit | Nicotinic acetylcholine receptor alpha3/beta2/alpha5
Type:Protein
Mol. Mass.:57020.50
Organism:Homo sapiens (Human)
Description:P17787
Residue:502
BDBM50049756
NameBDBM50049756
Synonyms:3-((S)-1-Methyl-pyrrolidin-2-ylmethoxy)-pyridine CHEMBL84149
TypeSmall organic molecule
Emp. Form.C11H16N2O
Mol. Mass.192.2575
SMILESCN1CCC[C@H]1COc1cccnc1