Reaction Details
TargetD(2) dopamine receptor
LigandBDBM50061669
Substrate/Competitorn/a
Meas. Tech.ChEMBL_62885 (CHEMBL673595)
Ki 3.3±n/a nM
Citation Mewshaw, REKavanagh, JStack, GMarquis, KLShi, XKagan, MZWebb, MBKatz, AHPark, AKang, YHAbou-Gharbia, MScerni, RWasik, TCortes-Burgos, LSpangler, TBrennan, JAPiesla, MMazandarani, HCockett, MIOchalski, RCoupet, JAndree, TH New generation dopaminergic agents. 1. Discovery of a novel scaffold which embraces the D2 agonist pharmacophore. Structure-activity relationships of a series of 2-(aminomethyl)chromans. J Med Chem40:4235-56 (1998) 
 
D(2) dopamine receptor
Name:D(2) dopamine receptor
Type:G Protein-Coupled Receptor (GPCR)
Mol. Mass.:50931.60
Organism:Rattus norvegicus (rat)
Description:P61169
Residue:444
BDBM50061669
NameBDBM50061669
Synonyms:(R)-2-(Benzylamino-methyl)-chroman-7-ol; oxalic acid CHEMBL64553
TypeSmall organic molecule
Emp. Form.C17H19NO2
Mol. Mass.269.3383
SMILESOc1ccc2CC[C@H](CNCc3ccccc3)Oc2c1