Reaction Details
TargetD(2) dopamine receptor
LigandBDBM50061631
Substrate/Competitorn/a
Meas. Tech.ChEMBL_62884 (CHEMBL673594)
Ki 0.50±n/a nM
Citation Mewshaw, REKavanagh, JStack, GMarquis, KLShi, XKagan, MZWebb, MBKatz, AHPark, AKang, YHAbou-Gharbia, MScerni, RWasik, TCortes-Burgos, LSpangler, TBrennan, JAPiesla, MMazandarani, HCockett, MIOchalski, RCoupet, JAndree, TH New generation dopaminergic agents. 1. Discovery of a novel scaffold which embraces the D2 agonist pharmacophore. Structure-activity relationships of a series of 2-(aminomethyl)chromans. J Med Chem40:4235-56 (1998) 
 
D(2) dopamine receptor
Name:D(2) dopamine receptor
Type:G Protein-Coupled Receptor (GPCR)
Mol. Mass.:50931.60
Organism:Rattus norvegicus (rat)
Description:P61169
Residue:444
BDBM50061631
NameBDBM50061631
Synonyms:2-{[3-(Benzooxazol-6-yloxy)-propylamino]-methyl}-chroman-7-ol; oxalic acid | CHEMBL334616
TypeSmall organic molecule
Emp. Form.C20H22N2O4
Mol. Mass.354.3997
SMILESOc1ccc2CCC(CNCCCOc3ccc4ncoc4c3)Oc2c1