Reaction Details
Target5-hydroxytryptamine receptor 1A
LigandBDBM50061675
Substrate/Competitorn/a
Meas. Tech.ChEMBL_1413 (CHEMBL616201)
Ki 0.60±n/a nM
Citation Mewshaw, REKavanagh, JStack, GMarquis, KLShi, XKagan, MZWebb, MBKatz, AHPark, AKang, YHAbou-Gharbia, MScerni, RWasik, TCortes-Burgos, LSpangler, TBrennan, JAPiesla, MMazandarani, HCockett, MIOchalski, RCoupet, JAndree, TH New generation dopaminergic agents. 1. Discovery of a novel scaffold which embraces the D2 agonist pharmacophore. Structure-activity relationships of a series of 2-(aminomethyl)chromans. J Med Chem40:4235-56 (1998) 
 
5-hydroxytryptamine receptor 1A
Name:5-hydroxytryptamine receptor 1A
Type:G Protein-Coupled Receptor (GPCR)
Mol. Mass.:46445.29
Organism:Rattus norvegicus (rat)
Description:Binding assays were performed using rat hippocampal membranes.
Residue:422
BDBM50061675
NameBDBM50061675
Synonyms:2-{[3-(1H-Indol-4-yloxy)-propylamino]-methyl}-chroman-7-ol; oxalic acid | CHEMBL134707
TypeSmall organic molecule
Emp. Form.C21H24N2O3
Mol. Mass.352.4269
SMILESOc1ccc2CCC(CNCCCOc3cccc4[nH]ccc34)Oc2c1