Reaction Details
TargetCholecystokinin receptor type A
LigandBDBM50061830
Substrate/Competitorn/a
Meas. Tech.ChEMBL_47645 (CHEMBL659916)
Ki 19±n/a nM
Citation Pierson, MEComstock, JMSimmons, RDKaiser, FJulien, RZongrone, JRosamond, JD Synthesis and biological evaluation of potent, selective, hexapeptide CCK-A agonist anorectic agents. J Med Chem40:4302-7 (1998) 
 
Cholecystokinin receptor type A
Name:Cholecystokinin receptor type A
Type:Enzyme Catalytic Domain
Mol. Mass.:49676.37
Organism:RAT
Description:Cholecystokinin central 0 RAT::P30551
Residue:444
BDBM50061830
NameBDBM50061830
Synonyms:(R)-N-((S)-1-Carbamoyl-2-phenyl-ethyl)-3-{(S)-2-[(S)-3-(1H-indol-3-yl)-2-(2-{(S)-4-methylsulfanyl-2-[2-(4-sulfooxy-phenyl)-acetylamino]-butyrylamino}-acetylamino)-propionylamino]-4-methylsulfanyl-butyrylamino}-succinamic acid | CHEMBL341762
TypeSmall organic molecule
Emp. Form.C44H54N8O13S3
Mol. Mass.999.14
SMILESCSCC[C@H](NC(=O)Cc1ccc(OS(O)(=O)=O)cc1)C(=O)NCC(=O)N[C@@H](Cc1c[nH]c2ccccc12)C(=O)N[C@@H](CCSC)C(=O)N[C@H](CC(O)=O)C(=O)N[C@@H](Cc1ccccc1)C(N)=O