Reaction Details
TargetGastrin/cholecystokinin type B receptor
LigandBDBM50369325
Substrate/Competitorn/a
Meas. Tech.ChEMBL_48603 (CHEMBL656926)
Ki>1000±n/a nM
Citation Pierson, MEComstock, JMSimmons, RDKaiser, FJulien, RZongrone, JRosamond, JD Synthesis and biological evaluation of potent, selective, hexapeptide CCK-A agonist anorectic agents. J Med Chem40:4302-7 (1998) 
 
Gastrin/cholecystokinin type B receptor
Name:Gastrin/cholecystokinin type B receptor
Type:Enzyme Catalytic Domain
Mol. Mass.:48980.43
Organism:RAT
Description:Cholecystokinin A CCKBR RAT::P30553
Residue:452
BDBM50369325
NameBDBM50369325
Synonyms:CHEMBL1791005
TypeSmall organic molecule
Emp. Form.C48H62N8O13S
Mol. Mass.991.117
SMILESCCCC[C@H](NC(=O)Cc1ccc(OS(O)(=O)=O)cc1)C(=O)NCC(=O)N[C@@H](Cc1c[nH]c2ccccc12)C(=O)N[C@@H]([C@@H](C)CC)C(=O)N(C)[C@@H](CC(O)=O)C(=O)N(C)[C@@H](Cc1ccccc1)C(N)=O