Reaction Details
TargetCholecystokinin receptor type A
LigandBDBM50369325
Substrate/Competitorn/a
Meas. Tech.ChEMBL_47645 (CHEMBL659916)
Ki 0.53±n/a nM
Citation Pierson, MEComstock, JMSimmons, RDKaiser, FJulien, RZongrone, JRosamond, JD Synthesis and biological evaluation of potent, selective, hexapeptide CCK-A agonist anorectic agents. J Med Chem40:4302-7 (1998) 
 
Cholecystokinin receptor type A
Name:Cholecystokinin receptor type A
Type:Enzyme Catalytic Domain
Mol. Mass.:49676.37
Organism:RAT
Description:Cholecystokinin central 0 RAT::P30551
Residue:444
BDBM50369325
NameBDBM50369325
Synonyms:CHEMBL1791005
TypeSmall organic molecule
Emp. Form.C48H62N8O13S
Mol. Mass.991.117
SMILESCCCC[C@H](NC(=O)Cc1ccc(OS(O)(=O)=O)cc1)C(=O)NCC(=O)N[C@@H](Cc1c[nH]c2ccccc12)C(=O)N[C@@H]([C@@H](C)CC)C(=O)N(C)[C@@H](CC(O)=O)C(=O)N(C)[C@@H](Cc1ccccc1)C(N)=O