Reaction Details
TargetCannabinoid receptor 1
LigandBDBM50056461
Substrate/Competitorn/a
Meas. Tech.ChEMBL_46297 (CHEMBL661066)
Ki 1820±n/a nM
Citation Sheskin, THanus, LSlager, JVogel, ZMechoulam, R Structural requirements for binding of anandamide-type compounds to the brain cannabinoid receptor. J Med Chem40:659-67 (1997) 
 
Cannabinoid receptor 1
Name:Cannabinoid receptor 1
Type:G Protein-Coupled Receptor (GPCR)
Mol. Mass.:52868.96
Organism:Homo sapiens (Human)
Description:P21554
Residue:472
BDBM50056461
NameBDBM50056461
Synonyms:(5Z,8Z,11Z,14Z)-Icosa-5,8,11,14-tetraenoic acid (2-methoxy-ethyl)-amide Icosa-5,8,11,14-tetraenoic acid (2-methoxy-ethyl)-amide (0609)
TypeSmall organic molecule
Emp. Form.C23H39NO2
Mol. Mass.361.5613
SMILESCCCCC\C=C/C\C=C/C\C=C/C\C=C/CCCC(=O)NCCOC