Reaction Details
TargetCannabinoid receptor 1
LigandBDBM50056459
Substrate/Competitorn/a
Meas. Tech.ChEMBL_46811 (CHEMBL659697)
Ki>1000±n/a nM
Citation Sheskin, THanus, LSlager, JVogel, ZMechoulam, R Structural requirements for binding of anandamide-type compounds to the brain cannabinoid receptor. J Med Chem40:659-67 (1997) 
 
Cannabinoid receptor 1
Name:Cannabinoid receptor 1
Type:G Protein-Coupled Receptor (GPCR)
Mol. Mass.:52856.55
Organism:Rattus norvegicus (rat)
Description:P20272
Residue:473
BDBM50056459
NameBDBM50056459
Synonyms:(5Z,8Z,11Z,14Z)-Icosa-5,8,11,14-tetraenoic acid pentylamide | CHEMBL347615
TypeSmall organic molecule
Emp. Form.C25H43NO
Mol. Mass.373.615
SMILESCCCCCNC(=O)CCC\C=C/C\C=C/C\C=C/C\C=C/CCCCC