Reaction Details
TargetCannabinoid receptor 1
LigandBDBM50056457
Substrate/Competitorn/a
Meas. Tech.ChEMBL_46295 (CHEMBL661064)
Ki 598±n/a nM
Citation Sheskin, THanus, LSlager, JVogel, ZMechoulam, R Structural requirements for binding of anandamide-type compounds to the brain cannabinoid receptor. J Med Chem40:659-67 (1997) 
 
Cannabinoid receptor 1
Name:Cannabinoid receptor 1
Type:G Protein-Coupled Receptor (GPCR)
Mol. Mass.:52868.96
Organism:Homo sapiens (Human)
Description:P21554
Residue:472
BDBM50056457
NameBDBM50056457
Synonyms:(8Z,11Z,14Z)-N-(2-hydroxyethyl)icosa-8,11,14-trienamide 8,11,14-Eicosatrienoylethanolamide CHEMBL121229 Homo-gamma-linolenylethanolamide | N-(8Z,11Z,14Z-icosatrienoyl)-ethanolamide
TypeSmall organic molecule
Emp. Form.C22H39NO2
Mol. Mass.349.5506
SMILESCCCCC\C=C/C\C=C/C\C=C/CCCCCCC(=O)NCCO