Reaction Details
TargetCannabinoid receptor 1
LigandBDBM50056493
Substrate/Competitorn/a
Meas. Tech.ChEMBL_46454 (CHEMBL877676)
Ki 12200±n/a nM
Citation Sheskin, THanus, LSlager, JVogel, ZMechoulam, R Structural requirements for binding of anandamide-type compounds to the brain cannabinoid receptor. J Med Chem40:659-67 (1997) 
 
Cannabinoid receptor 1
Name:Cannabinoid receptor 1
Type:G Protein-Coupled Receptor (GPCR)
Mol. Mass.:52868.96
Organism:Homo sapiens (Human)
Description:P21554
Residue:472
BDBM50056493
NameBDBM50056493
Synonyms:(4E,7Z,10Z,13Z,16Z,19E)-Docosa-4,7,10,13,16,19-hexaenoic acid (2-hydroxy-ethyl)-amide | CHEMBL161520
TypeSmall organic molecule
Emp. Form.C24H37NO2
Mol. Mass.371.5561
SMILESCC\C=C\C\C=C/C\C=C/C\C=C/C\C=C/C\C=C\CCC(=O)NCCO