Reaction Details
TargetMu-type opioid receptor
LigandBDBM50056632
Substrate/Competitorn/a
Meas. Tech.ChEMBL_145284 (CHEMBL751220)
Ki 51±n/a nM
Citation Palmer, RBUpthagrove, ALNelson, WL (E)- and (Z)-7-arylidenenaltrexones: synthesis and opioid receptor radioligand displacement assays. J Med Chem40:749-53 (1997) 
 
Mu-type opioid receptor
Name:Mu-type opioid receptor
Type:Enzyme Catalytic Domain
Mol. Mass.:11165.58
Organism:GUINEA PIG
Description:P97266
Residue:98
BDBM50056632
NameBDBM50056632
Synonyms:10,17-dihydroxy-4-isobutyl-15-[1-(2-naphthyl)-(Z)-methylidene]-(5R,13R,17S)-12-oxa-4-azapentacyclo[9.6.1.01,13.05,17.07,18]octadeca-7(18),8,10-trien-14-one | CHEMBL165410
TypeSmall organic molecule
Emp. Form.C31H31NO4
Mol. Mass.481.5821
SMILESCC(C)CN1CCC23[C@H]4Oc5c2c(C[C@@H]1[C@]3(O)CC(=Cc1ccc2ccccc2c1)C4=O)ccc5O